update directprint

4 jobs for master in 6 minutes and 20 seconds
Status Job ID Name Coverage
  Deploy
failed #34020
deploy-directprint

00:06:20

failed #34019
deploy-kiosk

00:00:57

failed #34022
deploy-linux

00:00:56

failed #34021
deploy-win

00:00:57

 
Name Stage Failure
failed
deploy-directprint Deploy
Received disconnect from 131.234.157.5 port 22:2: Too many authentication failures
Disconnected from 131.234.157.5 port 22
lost connection
Permission denied, please try again.
Received disconnect from 131.234.157.5 port 22:2: Too many authentication failures
Disconnected from 131.234.157.5 port 22
make: *** [deploy-directprint] Error 255
Makefile:138: recipe for target 'deploy-directprint' failed
ERROR: Job failed: exit code 1
failed
deploy-kiosk Deploy
Because copyclient_ng depends on build_web_compilers >=2.10.0 which requires SDK version >=2.8.0-dev.10.0 <3.0.0, version solving failed.
Makefile:9: recipe for target 'build' failed
make[1]: Leaving directory '/builds/asta/copyclient_electron/src'
make[1]: *** [build] Error 1
cp: cannot stat 'build/*': No such file or directory
sed: can't read ../web/index.html: No such file or directory
Makefile:152: recipe for target 'build-kiosk' failed
make: *** [build-kiosk] Error 2
ERROR: Job failed: exit code 1
failed
deploy-win Deploy
Because copyclient_ng depends on build_web_compilers >=2.10.0 which requires SDK version >=2.8.0-dev.10.0 <3.0.0, version solving failed.
make[1]: *** [build] Error 1
Makefile:9: recipe for target 'build' failed
make[1]: Leaving directory '/builds/asta/copyclient_electron/src'
cp: cannot stat 'build/*': No such file or directory
sed: can't read ../web/index.html: No such file or directory
make: *** [build-win] Error 2
Makefile:56: recipe for target 'build-win' failed
ERROR: Job failed: exit code 1
failed
deploy-linux Deploy
Because copyclient_ng depends on build_web_compilers >=2.10.0 which requires SDK version >=2.8.0-dev.10.0 <3.0.0, version solving failed.
make[1]: *** [build] Error 1
Makefile:9: recipe for target 'build' failed
make[1]: Leaving directory '/builds/asta/copyclient_electron/src'
cp: cannot stat 'build/*': No such file or directory
sed: can't read ../web/index.html: No such file or directory
make: *** [build-linux] Error 2
Makefile:90: recipe for target 'build-linux' failed
ERROR: Job failed: exit code 1