update dockerfile

5 jobs for master in 8 minutes and 36 seconds (queued for 2 seconds)
Status Job ID Name Coverage
  Deploy
failed #34027
deploy-directprint

00:05:36

failed #34023
deploy-kiosk

00:02:59

failed #34026
deploy-linux

00:02:59

failed #34025
deploy-win

00:02:59

failed #34024
deploy-directprint

00:06:59

 
Name Stage Failure
failed
deploy-directprint Deploy
Disconnected from 131.234.157.5 port 22
lost connection
Load key "/root/.ssh/id_rsa": invalid format
Permission denied, please try again.
Permission denied, please try again.
Received disconnect from 131.234.157.5 port 22:2: Too many authentication failures
Disconnected from 131.234.157.5 port 22
make: *** [Makefile:138: deploy-directprint] Error 255
ERROR: Job failed: exit code 1
failed
deploy-win Deploy
Changed 1 dependency!
webdev could not run for this project.
The `build_web_compilers` version – 2.10.0 – is not within the allowed constraint – >=2.12.0 <3.0.0.
make[1]: Leaving directory '/builds/asta/copyclient_electron/src'
make[1]: *** [Makefile:9: build] Error 78
cp: cannot stat 'build/*': No such file or directory
sed: can't read ../web/index.html: No such file or directory
make: *** [Makefile:58: build-win] Error 2
ERROR: Job failed: exit code 1
failed
deploy-linux Deploy
Changed 1 dependency!
webdev could not run for this project.
The `build_web_compilers` version – 2.10.0 – is not within the allowed constraint – >=2.12.0 <3.0.0.
make[1]: *** [Makefile:9: build] Error 78
make[1]: Leaving directory '/builds/asta/copyclient_electron/src'
cp: cannot stat 'build/*': No such file or directory
sed: can't read ../web/index.html: No such file or directory
make: *** [Makefile:93: build-linux] Error 2
ERROR: Job failed: exit code 1
failed
deploy-kiosk Deploy
Changed 1 dependency!
webdev could not run for this project.
The `build_web_compilers` version – 2.10.0 – is not within the allowed constraint – >=2.12.0 <3.0.0.
make[1]: *** [Makefile:9: build] Error 78
make[1]: Leaving directory '/builds/asta/copyclient_electron/src'
cp: cannot stat 'build/*': No such file or directory
sed: can't read ../web/index.html: No such file or directory
make: *** [Makefile:155: build-kiosk] Error 2
ERROR: Job failed: exit code 1