update dockerfile

4 jobs for master in 4 minutes and 53 seconds (queued for 2 seconds)
Status Job ID Name Coverage
  Deploy
passed #34029
deploy-directprint

00:04:53

failed #34028
deploy-kiosk

00:00:50

failed #34031
deploy-linux

00:00:50

failed #34030
deploy-win

00:00:50

 
Name Stage Failure
failed
deploy-win Deploy
Changed 1 dependency!
webdev could not run for this project.
The `build_web_compilers` version – 2.10.0 – is not within the allowed constraint – >=2.12.0 <3.0.0.
make[1]: Leaving directory '/builds/asta/copyclient_electron/src'
make[1]: *** [Makefile:9: build] Error 78
cp: cannot stat 'build/*': No such file or directory
sed: can't read ../web/index.html: No such file or directory
make: *** [Makefile:58: build-win] Error 2
ERROR: Job failed: exit code 1
failed
deploy-linux Deploy
Changed 1 dependency!
webdev could not run for this project.
The `build_web_compilers` version – 2.10.0 – is not within the allowed constraint – >=2.12.0 <3.0.0.
make[1]: *** [Makefile:9: build] Error 78
make[1]: Leaving directory '/builds/asta/copyclient_electron/src'
cp: cannot stat 'build/*': No such file or directory
sed: can't read ../web/index.html: No such file or directory
make: *** [Makefile:93: build-linux] Error 2
ERROR: Job failed: exit code 1
failed
deploy-kiosk Deploy
Changed 1 dependency!
webdev could not run for this project.
The `build_web_compilers` version – 2.10.0 – is not within the allowed constraint – >=2.12.0 <3.0.0.
make[1]: Leaving directory '/builds/asta/copyclient_electron/src'
make[1]: *** [Makefile:9: build] Error 78
cp: cannot stat 'build/*': No such file or directory
sed: can't read ../web/index.html: No such file or directory
make: *** [Makefile:155: build-kiosk] Error 2
ERROR: Job failed: exit code 1